{"text_format":"1","workbook":"xlsx","n_sheets":3,"sheets":["Отправка","Settinngs","Ключи"],"not_rendered":{"charts":0,"images":0,"macros":1,"external_links":0,"defined_names":25,"comments":0,"pivot_tables":0},"unopened":[],"bounds":{"document_bytes":16777216,"sheet_cells":100000,"rows_first":2000,"rows_last":500,"rows_between":2000,"halvings":0,"cell_chars":16384,"cell_head_chars":4096},"cells_cut":0,"cells_raw":0,"read":"whole","date_system":"1900"}

{"sheet":"Отправка","index":0,"n_rows":40,"n_cols":28,"rows_kept":40,"cut":false,"hidden":false,"merged":[[0,5,1,17],[6,5,6,15],[31,4,31,6],[4,1,4,26],[2,6,2,15],[26,4,26,6],[24,4,24,6],[25,4,25,6],[23,4,23,6],[23,7,23,10],[24,7,24,10],[25,7,25,10],[3,1,3,26],[11,7,11,9],[21,4,21,6],[22,4,22,6],[31,0,31,2],[12,0,12,4],[21,7,21,10],[11,10,11,11],[8,10,8,19],[9,7,9,9],[8,7,8,9],[10,7,10,9],[9,10,9,13],[10,10,10,13],[11,12,11,13],[11,14,11,16]]}
["Ваш персональный пароль:","kontrol",null,null,null,"Автоматизированное Рекурсивное ТЕстирование Методом Конечно-элементного Анализа - \"АРТЕМКА\"",null,null,null,null,null,null,null,null,null,null,null,null,null,null,null,null,null,null,null,null,null,"Список вариантов"]
["Кому:",{"$f":"Куда","v":"v_kataev@mail.ru"},null,null,null,null,null,null,null,null,null,null,null,null,null,null,null,null,null,null,null,null,null,null,null,null,null,{"$f":"Settinngs!H37","v":"№ 182"}]
["От кого:",{"$f":"IF(VLOOKUP(B1,Settinngs!E37:H75,3,0)=\"Укажите почту отправки в настройках\",Settinngs!C12,VLOOKUP(B1,Settinngs!E37:H75,3,0))","v":"Test_Rezult@mail.ru"},null,null,null,"Автор:","Виктор Катаев, учитель информатики МОУ Лицей г.Черемхово, \"1C-MEDIALINE\" версия 2.1",null,null,null,null,null,null,null,null,null,null,null,null,null,null,null,null,null,null,null,null,{"$f":"Settinngs!H38","v":"№ 24C"}]
["Тема письма:",{"$f":"CONCATENATE(K10,E14,K11,\"-\",Запрос,E14,H12,K12,E14,K9,\":\",S15,S17,S14,D22,D29,D23,D31,D25,D27,D26,D28)","v":"Катаев Виктор Борисович,учитель-учитель,Попытка:1,ЕГЭ РАЗДЕЛ А:ВЕРНЫХ=0,ОШИБОК=13,ПРОЦЕНТ=00,0%,ОЦЕНКА=2"},null,null,null,null,null,null,null,null,null,null,null,null,null,null,null,null,null,null,null,null,null,null,null,null,null,{"$f":"Settinngs!H39","v":"№ 529"}]
["Результат отправки",{"$f":"CONCATENATE(K10,E14,K11,\"-\",Запрос,E14,H12,K12,E14,K9,E14,E16,E15,E17,E18,E14,F16,F15,F17,F18,F14,G16,G15,G17,G18,G14,H16,H15,H17,H18,H14,I16,I15,I17,I18,I14,J16,J15,J17,J18,J14,K16,K15,K17,K18,K14,L16,L15,L17,L18,L14,M16,M15,M17,M18,M14,N16,N15,N17,N18,N14,O16,O15,O17,O18,O14,P16,P15,P17,P18,P14,Q16,Q15,Q17,Q18,Q14,D22,D29,D23,D31,D25,D27,D26,D28)","v":"Катаев Виктор Борисович,учитель-учитель,Попытка:1,ЕГЭ РАЗДЕЛ А,A1 =1-,A2 =1-,A3 =1-,A4 =1-,A5 =1-,A6 =1-,A7 =1-,A8 =1-,A9 =1-,A10 =1-,A11 =1-,A12 =1-,A13 =1-:ВЕРНЫХ=0,ОШИБОК=13,ПРОЦЕНТ=00,0%,ОЦЕНКА=2"},null,null,null,null,null,null,null,null,null,null,null,null,null,null,null,null,null,null,null,null,null,null,null,null,null,{"$f":"Settinngs!H40","v":"№ A94"}]
["Вложения (файлы):",null,null,null,null,"E-mail","v_kataev@mail.ru",null,null,null,null,null,null,null,null,null,null,null,null,null,null,null,null,null,null,null,null,{"$f":"Settinngs!H41","v":"№ 5B9"}]
[null,null,null,null,null,"Поля для Ввода обозначены коричневым цветом",null,null,null,null,null,null,null,null,null,null,null,null,null,null,null,null,null,null,null,null,null,{"$f":"Settinngs!H42","v":"№ BC5"}]
[null,null,null,null,null,null,null,null,null,null,null,null,null,null,null,null,null,null,null,null,null,null,null,null,null,null,null,{"$f":"Settinngs!H43","v":"№ E64"}]
["SMTPserver","smtp.mail.ru","<-выбрать значение из списка",null,null,null,null,"Название теста",null,null,"ЕГЭ РАЗДЕЛ А",null,null,null,null,null,null,null,null,null,null,null,null,null,null,null,null,{"$f":"Settinngs!H44","v":"№ C51 "}]
["Учетная запись",{"$f":"B3","v":"Test_Rezult@mail.ru"},"<-заполняется автоматически",null,null,null,null,"Фамилия: ",null,null,{"$f":"VLOOKUP(B1,Settinngs!E37:G75,2,0)","v":"Катаев Виктор Борисович"},null,null,null,null,"Верно"," +",null,null,null,null,null,null,null,null,null,null,{"$f":"Settinngs!H45","v":"№ 8A7"}]
["Пароль",null,null,null,null,null,null,"Вариант№",null,null,{"$f":"VLOOKUP(Отправка!B1,Settinngs!E37:H75,4,0)","v":"учитель"},null,null,null,null,"Ошибка"," -",null,null,null,null,null,null,null,null,null,null,{"$f":"Settinngs!H46","v":"№ C53"}]
[null,null,null,null,null,null,null,"Попытка:",null,null,{"$f":"Settinngs!J1+1","v":1},null,"Срок сдачи:",null,{"$f":"Сроки","v":"2014-12-31"},null,null,null,null,null,null,null,null,null,null,null,null,{"$f":"Settinngs!H47","v":"№ 190"}]
["Если вы не знаете пароль на учетную запись, удалите пароль совсем!",null,null,null,null,null,null,null,null,"Кол-во вопросов",13,null,null,null,null,null,null,null,null,null,null,null,null,null,null,null,null,{"$f":"Settinngs!H48","v":"№ D3D"}]
[null,null,null,null,",",",",",",",",",",",",",",",",",",",",",",",",":",null,null,null,null,null,null,null,null,null,null,{"$f":"Settinngs!H49","v":"№ ED0"}]
[null,null,null,null," ="," ="," ="," ="," ="," ="," ="," ="," ="," ="," ="," ="," =",null,null,null,null,null,null,null,null,null,null,{"$f":"Settinngs!H50","v":"№ 9C0"}]
[null,null,null,null,"A1","A2","A3","A4","A5","A6","A7","A8","A9","A10","A11","A12","A13",null,null,null,null,null,null,null,null,null,null,{"$f":"Settinngs!H51","v":"№ 693"}]
[null,null,null,null,1,1,1,1,1,1,1,1,1,1,1,1,1,null,null,null,null,null,null,null,null,null,null,{"$f":"Settinngs!H52","v":"№ 44E"}]
[null,null,null,null,"-","-","-","-","-","-","-","-","-","-","-","-","-","-","-","-","-","-","-","-","-","-",null,{"$f":"Settinngs!H53","v":"№ 612"}]
[null,null,null,null,{"$f":"VLOOKUP($K$11,Ключи!$A$3:$AC$41,2,0)","v":"A1"},{"$f":"VLOOKUP($K$11,Ключи!$A$3:$AC$41,3,0)","v":"1"},{"$f":"VLOOKUP($K$11,Ключи!$A$3:$AC$41,4,0)","v":"1"},{"$f":"VLOOKUP($K$11,Ключи!$A$3:$AC$41,5,0)","v":"1"},{"$f":"VLOOKUP($K$11,Ключи!$A$3:$AC$41,6,0)","v":"1"},{"$f":"VLOOKUP($K$11,Ключи!$A$3:$AC$41,7,0)","v":"1"},{"$f":"VLOOKUP($K$11,Ключи!$A$3:$AC$41,8,0)","v":"1"},{"$f":"VLOOKUP($K$11,Ключи!$A$3:$AC$41,9,0)","v":"1"},{"$f":"VLOOKUP($K$11,Ключи!$A$3:$AC$41,10,0)","v":"1"},{"$f":"VLOOKUP($K$11,Ключи!$A$3:$AC$41,11,0)","v":"1"},{"$f":"VLOOKUP($K$11,Ключи!$A$3:$AC$41,12,0)","v":"1"},{"$f":"VLOOKUP($K$11,Ключи!$A$3:$AC$41,13,0)","v":"1"},{"$f":"VLOOKUP($K$11,Ключи!$A$3:$AC$41,14,0)","v":"A13"},null,null,null,null,null,null,null,null,null,null,{"$f":"Settinngs!H54","v":"№ F85"}]
[null,null,null,null,{"$f":"IF(PinKod=Pin,IF(E17=E28,1,0),IF(E17=E19,1,0))","v":0},{"$f":"IF(PinKod=Pin,IF(F17=F28,1,0),IF(F17=F19,1,0))","v":0},0,0,0,0,0,0,0,0,0,0,0,null,null,null,null,null,null,null,null,null,null,{"$f":"Settinngs!H55","v":"№ B23"}]
[null,null,null,null,{"$f":"IF(E17<>\"\",1,0)","v":1},{"$f":"IF(F17<>\"\",1,0)","v":1},1,1,1,1,1,1,1,1,1,1,1,null,null,null,null,null,null,null,null,null,null,{"$f":"Settinngs!H56","v":"№ 72E"}]
[null,null,null,"ВЕРНЫХ=","Верных ответов:",null,null,0,null,null,null,null,null,null,null,null,null,null,null,null,null,null,null,null,null,null,null,{"$f":"Settinngs!H57","v":"№ 0F8"}]
[null,null,null,",ОШИБОК=","Ошибок:",null,null,{"$f":"Ошибок","v":13},null,null,null,null,null,null,null,null,null,null,null,null,null,null,null,null,null,null,null,{"$f":"Settinngs!H58","v":"№ 958"}]
[null,null,null,",% ВЫП=","% выполнения:",null,null,"100%",null,null,null,null,null,null,null,null,null,null,null,null,null,null,null,null,null,null,null,{"$f":"Settinngs!H59","v":"№ 755"}]
[null,null,null,",ПРОЦЕНТ=","% Верных ответов:",null,null,0,null,null,null,null,null,null,null,null,null,null,null,null,null,null,null,null,null,null,null,{"$f":"Settinngs!H60","v":"№ FEC"}]
[null,null,null,",ОЦЕНКА=","Оценка:",null,null,2,null,null,null,null,null,null,null,null,null,null,null,null,null,null,null,null,null,null,null,{"$f":"Settinngs!H61","v":"№ 8F1"}]
[null,null,null,{"$f":"TEXT((SUM(E20:Q20)/K13),\"00,0%\")","v":"00,0%"},null,null,null,null,null,null,null,null,null,null,null,null,null,null,null,null,null,null,null,null,null,null,null,{"$f":"Settinngs!H62","v":"№ 811"}]
[null,null,null,{"$f":"IF((SUM(E20:Z20)/K13)>=Settinngs!H3/100,Settinngs!I3,IF(((SUM(E20:Z20)/K13)>=Settinngs!H4/100) * ((SUM(E20:Z20)/K13)<Settinngs!H3/100),Settinngs!I4,IF(((SUM(E20:Z20)/K13)>=Settinngs!H5/100) * ((SUM(E20:Z20)/K13)<Settinngs!H4/100),Settinngs!I5,Settinngs!I6)))","v":2},{"$f":"VLOOKUP(Запрос,Ключи!$A$3:$AC$41,2,0)","v":"A1"},{"$f":"VLOOKUP(Запрос,Ключи!$A$3:$AC$41,3,0)","v":"1"},{"$f":"VLOOKUP(Запрос,Ключи!$A$3:$AC$41,4,0)","v":"1"},{"$f":"VLOOKUP(Запрос,Ключи!$A$3:$AC$41,5,0)","v":"1"},{"$f":"VLOOKUP(Запрос,Ключи!$A$3:$AC$41,6,0)","v":"1"},{"$f":"VLOOKUP(Запрос,Ключи!$A$3:$AC$41,7,0)","v":"1"},{"$f":"VLOOKUP(Запрос,Ключи!$A$3:$AC$41,8,0)","v":"1"},{"$f":"VLOOKUP(Запрос,Ключи!$A$3:$AC$41,9,0)","v":"1"},{"$f":"VLOOKUP(Запрос,Ключи!$A$3:$AC$41,10,0)","v":"1"},{"$f":"VLOOKUP(Запрос,Ключи!$A$3:$AC$41,11,0)","v":"1"},{"$f":"VLOOKUP(Запрос,Ключи!$A$3:$AC$41,12,0)","v":"1"},{"$f":"VLOOKUP(Запрос,Ключи!$A$3:$AC$41,13,0)","v":"1"},{"$f":"VLOOKUP(Запрос,Ключи!$A$3:$AC$41,14,0)","v":"A13"},null,null,null,null,null,null,null,null,null,null,{"$f":"Settinngs!H63","v":"№ C0E"}]
[null,null,null,{"$f":"SUM(E20:S20)","v":0},null,null,null,null,null,null,null,null,null,null,null,null,null,null,null,null,null,null,null,null,null,null,null,{"$f":"Settinngs!H64","v":"№ 144"}]
[null,null,null,{"$f":"TEXT((SUM(E21:S21)/K13),\"0%\")","v":"100%"},null,null,null,null,null,null,null,null,null,null,null,null,null,null,null,null,null,null,null,null,null,null,null,{"$f":"Settinngs!H65","v":"№ A35"}]
[null,null,null,13,null,null,null,null,null,null,null,null,null,null,null,null,null,null,null,null,null,null,null,null,null,null,null,{"$f":"Settinngs!H66","v":"№ 856"}]
["Для Администрирования:",null,null,null,"Шкала оценок %",null,null,null,null,null,null,null,null,null,null,null,null,null,null,null,null,null,null,null,null,null,null,{"$f":"Settinngs!H67","v":"№ 349"}]
[null,null,null,null,{"$f":"CONCATENATE(\">=\",F33,\"%\")","v":">=85%"},85,5,null,null,null,null,null,null,null,null,null,null,null,null,null,null,null,null,null,null,null,null,{"$f":"Settinngs!H68","v":"№ 988"}]
["Введите пин-код",null,null,null,{"$f":"CONCATENATE(\">=\",F34,\"%\",\"<\",F33,\"%\")","v":">=70%<85%"},70,4,null,null,null,null,null,null,null,null,null,null,null,null,null,null,null,null,null,null,null,null,{"$f":"Settinngs!H69","v":"№ 224"}]
[26254,null,null,null,{"$f":"CONCATENATE(\">=\",F35,\"%\",\"<\",F34,\"%\")","v":">=50%<70%"},50,3,null,null,null,null,null,null,null,null,null,null,null,null,null,null,null,null,null,null,null,null,{"$f":"Settinngs!H70","v":"№ 5CD"}]
[null,null,null,null,">=0%<50%",0,2,null,null,null,null,null,null,null,null,null,null,null,null,null,null,null,null,null,null,null,null,{"$f":"Settinngs!H71","v":"№ 843"}]
["Запрос варианта:","учитель",null,null,null,null,null,null,null,null,null,null,null,null,null,null,null,null,null,null,null,null,null,null,null,null,null,{"$f":"Settinngs!H72","v":"№ EE9"}]
["Изменить сроки:","2014-12-31",null,null,null,null,null,null,null,null,null,null,null,null,null,null,null,null,null,null,null,null,null,null,null,null,null,{"$f":"Settinngs!H73","v":"№ 3BB"}]
[null,null,null,null,null,null,null,null,null,null,null,null,null,null,null,null,null,null,null,null,null,null,null,null,null,null,null,{"$f":"Settinngs!H74","v":"№ A13"}]
[null,null,null,null,null,null,null,null,null,null,null,null,null,null,null,null,null,null,null,null,null,null,null,null,null,null,null,{"$f":"Settinngs!H75","v":"учитель"}]

{"sheet":"Settinngs","index":1,"n_rows":75,"n_cols":12,"rows_kept":75,"cut":false,"hidden":true,"merged":[[1,4,1,5],[0,7,0,8],[1,6,1,8],[7,4,11,6],[35,8,74,8]]}
["SMTPserver",null,null,null,null,null,null,"Попытка:",null,0]
["smtp.yandex.ru",null,null,null,"Режим тестирования",null,"Шкала оценок %",null,null,null,null,"Да"]
["smtp.mail.ru",null,null,null,"Показывать результаты","Да",{"$f":"CONCATENATE(\">=\",H3,\"%\")","v":">=85%"},85,5,null,null,"Нет"]
["mail.rambler.ru",null,null,null,"Количество разрешенных попыток",3,{"$f":"CONCATENATE(\">=\",H4,\"%\",\"<\",H3,\"%\")","v":">=70%<85%"},70,4]
["smtp.list.ru",null,null,null,"Подсказывать ошибки","Да",{"$f":"CONCATENATE(\">=\",H5,\"%\",\"<\",H4,\"%\")","v":">=50%<70%"},50,3]
["smtp.gmail.com",null,null,null,"Сроки сдачи (установите крайний срок)","2014-12-31",">=0%<50%",0,2]
["smtp.pochta.ru",null,null,null,"Сегодня (заполняется автоматически)",{"$f":"TODAY()","v":"2014-10-09"}]
["smtp.inbox.ru",null,null,null,"Постарайтесь не вставлять новые строки и столбцы (может потеряться работоспособность макросов)!!!"]
[]
[null,"Заполняется автоматически","По умолчанию"]
[null,"v_kataev@mail.ru","v_kataev@mail.ru","<-Куда"]
[null,{"$f":"Отправка!B10","v":"Test_Rezult@mail.ru"},"Test_Rezult@mail.ru","<-Откуда"]
[null,{"$f":"IF(Отправка!B11=\"\",C13,Отправка!B11)","v":"test26254"},"test26254","<-Пароль"]
[null,{"$f":"Отправка!B9","v":"smtp.mail.ru"},"smtp.mail.ru","<-Smtp"]
[null,null,26254,"Pin"]
[]
[]
[]
[]
[]
[]
[]
[]
[]
[]
[]
[]
[]
[]
[]
[]
[]
[]
[]
[]
[null,null,null,null,"Пароль доступа","Фамилия Имя","Адрес Почты","Вариант №","Обязательно ставьте сивол номер № (Например №56)"]
[null,null,null,null,"Random1996","Алексеева Яна 11 А","Укажите почту отправки в настройках",{"$f":"Ключи!A4","v":"№ 182"}]
[null,null,null,null,"polisha000","Андреева Полина 11 А","Укажите почту отправки в настройках",{"$f":"Ключи!A5","v":"№ 24C"}]
[null,null,null,null,"настя0742","Балабанова Настя 11 А","Укажите почту отправки в настройках",{"$f":"Ключи!A6","v":"№ 529"}]
[null,null,null,null,2206230196,"Бардакова Маша 11 А","Укажите почту отправки в настройках",{"$f":"Ключи!A7","v":"№ A94"}]
[null,null,null,null,"52277my","Булаева Алина 11 А","Укажите почту отправки в настройках",{"$f":"Ключи!A8","v":"№ 5B9"}]
[null,null,null,null,"chekist228","Захаров Кирилл 11 А","Укажите почту отправки в настройках",{"$f":"Ключи!A9","v":"№ BC5"}]
[null,null,null,null,"Zikova","Зыкова Софья 11 А","Укажите почту отправки в настройках",{"$f":"Ключи!A10","v":"№ E64"}]
[null,null,null,null,"n199611055516753803908n","Копалкин Никита 11 А","Укажите почту отправки в настройках",{"$f":"Ключи!A11","v":"№ C51 "}]
[null,null,null,null,"644850445N","Кравец Настя 11 А","Укажите почту отправки в настройках",{"$f":"Ключи!A12","v":"№ 8A7"}]
[null,null,null,null,87654321,"Логачева Саша 11 А","Укажите почту отправки в настройках",{"$f":"Ключи!A13","v":"№ C53"}]
[null,null,null,null,"Listakind","Мильшина Вера 11 А","Укажите почту отправки в настройках",{"$f":"Ключи!A14","v":"№ 190"}]
[null,null,null,null,"QERTY123","Мурашев Дима 11 А","Укажите почту отправки в настройках",{"$f":"Ключи!A15","v":"№ D3D"}]
[null,null,null,null,"okolo228","Никитин Женя 11 А","Укажите почту отправки в настройках",{"$f":"Ключи!A16","v":"№ ED0"}]
[null,null,null,null,"Informatika96","Погосян Лилит 11 А","Укажите почту отправки в настройках",{"$f":"Ключи!A17","v":"№ 9C0"}]
[null,null,null,null,"Rogercter975","Ремкунас Ира 11 А","Укажите почту отправки в настройках",{"$f":"Ключи!A18","v":"№ 693"}]
[null,null,null,null,"Semenuk1337","Семенюк Артем, 11 А","Укажите почту отправки в настройках",{"$f":"Ключи!A19","v":"№ 44E"}]
[null,null,null,null,"Denis1337","Семенюк Денис 11 А","Укажите почту отправки в настройках",{"$f":"Ключи!A20","v":"№ 612"}]
[null,null,null,null,"KuroKy228","Супрун Андрей 11 А","Укажите почту отправки в настройках",{"$f":"Ключи!A21","v":"№ F85"}]
[null,null,null,null,12060595,"Файзулина Рима 11 А","Укажите почту отправки в настройках",{"$f":"Ключи!A22","v":"№ B23"}]
[null,null,null,null,10081969,"Чегодаева Даша 11 А","Укажите почту отправки в настройках",{"$f":"Ключи!A23","v":"№ 72E"}]
[null,null,null,null,"Sharipov","Шарыпов Илья 11 А","Укажите почту отправки в настройках",{"$f":"Ключи!A24","v":"№ 0F8"}]
[null,null,null,null,"Abdikadiriva","Абдыкадырова Аделина 11 Б","Укажите почту отправки в настройках",{"$f":"Ключи!A25","v":"№ 958"}]
[null,null,null,null,48151623,"Абрамович Дарья 11 Б","Укажите почту отправки в настройках",{"$f":"Ключи!A26","v":"№ 755"}]
[null,null,null,null,"Barhatova","Бархатова Ольга 11 Б","Укажите почту отправки в настройках",{"$f":"Ключи!A27","v":"№ FEC"}]
[null,null,null,null,"maria_vas","Васильева Мария 11 Б","Укажите почту отправки в настройках",{"$f":"Ключи!A28","v":"№ 8F1"}]
[null,null,null,null,"Julia_96","Гайнулина Юлия 11 Б","Укажите почту отправки в настройках",{"$f":"Ключи!A29","v":"№ 811"}]
[null,null,null,null,"Kogut","Когут Дарья 11 Б","Укажите почту отправки в настройках",{"$f":"Ключи!A30","v":"№ C0E"}]
[null,null,null,null,"ArinaLav","Лавренина Арина 11 Б","Укажите почту отправки в настройках",{"$f":"Ключи!A31","v":"№ 144"}]
[null,null,null,null,"Lanovaya","Лановая Анастасия 11 Б","Укажите почту отправки в настройках",{"$f":"Ключи!A32","v":"№ A35"}]
[null,null,null,null,87654320,"Марченко Валентина 11 Б","Укажите почту отправки в настройках",{"$f":"Ключи!A33","v":"№ 856"}]
[null,null,null,null,"Miheeva","Михеева Анастасия 11 Б","Укажите почту отправки в настройках",{"$f":"Ключи!A34","v":"№ 349"}]
[null,null,null,null,"A180996S","Сахаров Андрей 11 Б","Укажите почту отправки в настройках",{"$f":"Ключи!A35","v":"№ 988"}]
[null,null,null,null,"Svistunova","Свистунова Ксения 11 Б","Укажите почту отправки в настройках",{"$f":"Ключи!A36","v":"№ 224"}]
[null,null,null,null,787878,"Середкин Владислав 11 Б","Укажите почту отправки в настройках",{"$f":"Ключи!A37","v":"№ 5CD"}]
[null,null,null,null,"64_@Fi4HdM","Черных Анастасия 11 Б","Укажите почту отправки в настройках",{"$f":"Ключи!A38","v":"№ 843"}]
[null,null,null,null,52835942,"Черных Мария 11 Б","Укажите почту отправки в настройках",{"$f":"Ключи!A39","v":"№ EE9"}]
[null,null,null,null,"elena***","Яськова Елена 11 Б","Укажите почту отправки в настройках",{"$f":"Ключи!A40","v":"№ 3BB"}]
[null,null,null,null,1082013,"Лучинская Анастасия 11 Б","Укажите почту отправки в настройках",{"$f":"Ключи!A41","v":"№ A13"}]
[null,null,null,null,"kontrol","Катаев Виктор Борисович","Test_Rezult@mail.ru","учитель"]

{"sheet":"Ключи","index":2,"n_rows":41,"n_cols":29,"rows_kept":41,"cut":false,"hidden":true,"merged":[]}
[]
["Вариант","А1","А2","А3","А4","А5","А6","А7","А8","А9","А10","А11","А12","А13","B1","B2","B3","B4","B5","B6","B7","B8","B9","B10","B11","B12","B13","B14","B15"]
["учитель","A1","1","1","1","1","1","1","1","1","1","1","1","A13","1","1","1","1","1","1","1","1","1","1","1","1","1","1","1"]
["№ 182",3,2,3,2,3,2,1,3,4,3,2,3,4,121211,75,3,56,32,315,8,5994,14,"А122","CECH",170,298,16,27]
["№ 24C",2,3,2,2,2,3,4,2,1,3,3,1,1,12211,20,2,2,16,840,3,37,24,"А216","BFEH",10800,32,-48,35]
["№ 529",1,1,2,4,4,4,2,1,2,4,2,1,3,21221,-17,3,124,25,99,8,417,14,"А10","CBFA",10800,32,3,27]
["№ A94",1,2,2,2,2,4,3,4,4,3,4,1,3,21221,12,3,28,16,191,12,104,12,"Б2","CECH",277,15,16,31]
["№ 5B9",1,2,2,2,2,4,2,4,3,4,2,2,3,12121,71,2,27,30,315,114,607,13,"А122","BHEA",250,298,25,24]
["№ BC5",3,1,4,2,2,4,2,4,4,3,2,3,4,21221,75,5,2,150,43,3,85,14,"Б6","DFDH",277,448,127,275]
["№ E64",3,1,4,4,4,4,4,1,4,4,2,1,2,11212,90,7,28,36,43,5,9910,14,"А216","CBFA",533,96,127,275]
["№ C51 ",2,2,4,4,1,4,2,1,3,1,2,3,4,12121,50,2,9,147,360,12,91,23,"А170","DFAB",2300,36,1,35]
["№ 8A7",3,1,2,4,1,1,4,1,3,2,2,3,4,11121,75,12,81,77,315,11,37,46,"А10","DFBH",2200,448,127,11]
["№ C53",3,3,4,4,3,3,4,2,3,3,1,3,3,11212,71,2,248,55,191,5,51,12,"Б2","CECH",533,38,-20,244]
["№ 190",1,1,4,2,2,3,1,3,2,3,4,2,2,21121,300,3,9,30,840,9,37,24,"А122","DEFA",2200,38,-5,24]
["№ D3D",2,3,4,4,4,2,2,1,2,1,3,3,3,11121,135,8,2,165,105,3,91,23,"А76","DFDH",2300,2,30,11]
["№ ED0",3,2,4,4,3,3,3,2,1,4,4,3,2,11212,12,3,248,77,21,114,9910,8,"А148","DFFH",2300,32,25,64]
["№ 9C0",1,3,2,1,2,1,3,3,3,2,4,2,4,12211,72,8,8,165,306,14,170,46,"А120","HBFA",2200,572,127,1849]
["№ 693",1,2,2,2,2,3,1,3,2,3,4,1,2,8,90,3,8,36,360,114,157,18,"А148","ECFA",533,15,16,364]
["№ 44E",1,3,2,2,2,4,3,1,3,1,4,4,3,12121,-10,5,9,707,191,53,9910,14,"А76","HBFA",427,102,-20,275]
["№ 612",4,2,3,3,2,3,2,1,1,3,4,2,2,11121,10,5,9,16,155,9,417,24,"А50","HBFA",2200,230,-3,27]
["№ F85",2,3,2,2,1,2,3,2,3,3,2,3,1,12121,300,5,27,165,87,8,170,46,"А234","HBFA",3400,230,1,64]
["№ B23",1,2,4,1,4,3,1,1,3,1,2,4,3,12121,98,4,124,150,191,14,987,24,"А120","CECH",427,15,27,24]
["№ 72E",1,3,2,2,2,4,3,1,3,1,4,4,3,12121,-10,5,9,707,191,53,9910,14,"А76","HBFA",427,102,-20,275]
["№ 0F8",1,4,3,4,2,4,3,2,2,1,3,1,2,7,20,1,8,80,306,12,170,24,"А50","HEAD",2500,54,-20,11]
["№ 958",1,3,4,3,1,2,1,2,4,1,3,3,1,"Назад5",72,1,28,16,945,112,170,33,"А148","DFFH",250,38,16,64]
["№ 755",4,2,3,2,1,1,4,4,2,3,2,3,1,12121,90,5,108,32,99,114,91,17,"Б6","DFDH",50,298,25,244]
["№ FEC",3,2,4,4,1,2,2,3,1,4,3,3,2,12121,100,2,124,147,48,112,51,14,"А216","DEFA",4000,298,25,11]
["№ 8F1",4,3,4,2,4,3,4,4,1,2,3,2,3,12211,-10,12,1024,150,840,114,37,13,"А234","BHEA",140,2,-48,27]
["№ 811",3,2,1,2,1,2,3,1,2,1,3,3,3,11121,9,7,4,707,21,5,607,20,"А52","HBFA",427,2,-3,231]
["№ C0E",2,4,4,4,1,4,2,1,1,3,4,3,1,12121,98,12,81,36,945,5,179,24,"А26","HBFA",170,15,3,24]
["№ 144",1,2,4,3,2,3,3,1,3,1,2,1,2,21121,75,5,2,147,315,14,9910,24,"А48","HCEA",3400,15,30,25]
["№ A35",1,2,2,3,2,3,4,2,4,3,2,1,2,11121,90,1,108,36,48,3,91,33,"А148","HCEA",2200,225,-20,27]
["№ 856",3,3,2,2,4,3,3,4,1,1,2,1,2,"Назад5",50,2,8,65,21,14,607,16,"А52","CECH",450,32,30,1849]
["№ 349",3,2,4,4,1,4,4,4,3,3,2,3,3,12121,20,2,4,16,43,12,987,12,"А120","HBFA",170,230,127,1849]
["№ 988",2,3,4,3,2,1,1,1,3,3,3,3,3,7,72,2,27,16,280,5,170,46,"А76","DFAB",277,32,1,9]
["№ 224",1,1,3,3,3,2,1,4,2,2,2,1,2,11121,-17,5,56,65,89,112,91,13,"А76","DFAB",50,448,131,64]
["№ 5CD",3,3,3,4,1,4,3,1,2,3,2,3,3,21121,-10,2,343,65,99,112,607,46,"А216","HCEA",2300,32,27,31]
["№ 843",2,4,4,4,1,4,1,1,1,4,3,3,2,121211,71,5,28,660,87,9,986,17,"А234","BCAH",2200,54,16,24]
["№ EE9",3,1,2,4,2,3,1,1,2,3,3,1,2,12211,72,8,4,165,43,24,37,14,"Б2","HBEA",140,230,25,25]
["№ 3BB",4,1,4,4,2,4,2,4,1,2,4,3,3,7,-17,5,108,660,191,53,987,16,"А234","BFEH",170,448,-48,231]
["№ A13",1,1,3,2,1,4,2,2,3,1,2,4,1,11212,135,5,108,32,48,12,37,33,"А106","ECFA",4000,230,-3,231]